{"text_format":"1","workbook":"xlsx","n_sheets":7,"sheets":["Framside","Risikovurdering","Risikokriterie","Tema for risikovurdering","Hjelpespørsmål","Datakjelder","Dataark"],"not_rendered":{"charts":0,"images":0,"macros":0,"external_links":0,"defined_names":2,"comments":0,"pivot_tables":0},"unopened":[],"bounds":{"document_bytes":16777216,"sheet_cells":100000,"rows_first":2000,"rows_last":500,"rows_between":2000,"halvings":0,"cell_chars":16384,"cell_head_chars":4096},"cells_cut":0,"cells_raw":0,"read":"whole","date_system":"1900"}

{"sheet":"Framside","index":0,"n_rows":25,"n_cols":7,"rows_kept":25,"cut":false,"hidden":false,"merged":[[17,0,21,0],[24,2,24,6],[7,2,13,6],[15,2,15,6],[1,0,1,1],[2,0,2,1],[3,0,3,1],[7,0,13,1],[1,3,1,6],[2,3,2,6],[3,3,3,6]]}
[]
["Kategori",null,"Beskrivelse","Fyll inn:"]
["ROS av:",null,"Kva system/prosess skal det gjennomførast ROS av? "]
["Avgrensning/Scope",null,"Kva avgrensningar er gjort? Kva er ikkje omfatta? "]
["Tidsrom for gjennomføring:"]
["Deltakarar: "]
{"$rows_left_out":20}
{"sheet":"Risikovurdering","index":1,"n_rows":106,"n_cols":15,"rows_kept":106,"cut":false,"hidden":false,"merged":[[4,0,4,14],[0,0,0,14]]}
["Eksempel"]
[null,"Nummer","Kategori","Tittel","Skildring","Årsak","Nosituasjon","Bakgrunn for vurdering av sannsyn og konsekvens","Sannsyn","Konsekvens","Risiko","Moglege nye tiltak","Ansvarleg","Frist","Inkluderast i DPIA? "]
["Skildring",null,"Er riskoen av teknisk eller funksjonell art? Tekniske risikoar omfattar til dømes risiko knytt til sjølve systemet, medan funksjonell risiko omfattar prosessar, prosedyrar og bruken av systemet. ","Skriv ein kort og overordna tittel for å skildra risikoen","Skildringa skal svara ut følgande spørsmål: \n1. Kva skjer med systemet eller opplysningane? \n2. Kva konsekvensar har hendinga? ","Kva er årsaka til hendinga? ","Nosituasjon skal svara ut følgjande spørsmål: \n1. Kva tekniske eller organisatoriske tiltak er etablert for å hindra denne hendinga? \n2. Har hendinga skjedd tidlegare, eventuelt kor ofte skjer dette? ","Kva er bakgrunnen for vurderinga av sannsyn? \n\nKva er bakgrunnen for vurderinga av konsekvensen? ","Vurder frå 1-5","Vurder frå 1-5",null,"Kva slags nye tiltak kan implementerast for å redusere sannsynet? ","Kven er ansvarleg for å utføra tiltaket? Vedkommande kan delegere ansvaret vidare ved behov. ","Kva er frista for utføring av tiltaket? ","Omfattar hendinga personvern? "]
["Døme","Døme: R1","Funksjonell ","Helsepersonell har tilgang til informasjon uten tenleg behov grunna manglande oversikt over tilgangar ","Helsepersonell har tilgang på helse- og personopplysningar dei ikkje har tenleg behov for å sjå. Konsekvensen av denne hendinga er potensielt at helsepersonell utnyttar sin tilgang og snokar i informasjon dei ikkje har tenleg behov for, og det kan medføre brot på personopplysningsloven .","Manglande oversyn over kven som har kva slags tilganger","Eksisterande tiltak: \n- Det er rutinar for å søke om tilgangar for nytilsette\n- Det manglar rutinar for å avslutte tilgangar når nokon sluttar/byttar avdeling\n- Det manglar rutine for å gjennomgå og oppdatere tilgangsoversyn\n\nDet er kjent at fleire har tilgang utover tenleg behov fordi dei framleis har tilgangar frå sine gamle avdelingar. Det er usikkert kor mange det gjeld. ","Sannsyn for hendinga vert vurdert til høg, fordi det er kjent at dette har skjedd ved fleire anledningar og ein manglar oversyn over kor mange dette gjeld. I tillegg aukar sannsynet fordi det ikkje eksisterar tilstrekkeleg tiltak for å hindre hendinga, til dømes:\n- Manglande rutinar for avslutting av tilgangar\n- Manglande rutine for å gjennomgå og oppdatere tilgangsoversyn\n\nKonsekvensen av at helsepersonell har tilgang på informasjon uten tenleg behov, kan potensielt føre til brot på personopplysningsloven. Dette vert vurdert til moderat konsekvens. ",2,3,{"$f":"IF(I4*J4=0,\"\",VLOOKUP(I4,Dataark!$AE$16:$AJ$21,Risikovurdering!J4+1,TRUE))","v":"Middels"},"Etablere rutiner for å avslutte tilganger når noen slutter/bytter avdeling. Dette kan være nærmeste leders ansvar og sørge for og bør inkluderes i deres ansvarsbeskrivelse. \n\nEtablere rutine for å jevnlig gjennomgå tilganger. Det bør vurderes hvem som skal ha denne rollen og frekvensen av gjennomgangene. ","Person X","2021-05-31"]
[]
[null,"Nummer","Kategori","Tittel","Skildring","Årsak","Nosituasjon","Bakgrunn for vurdering av sannsyn og konsekvens","Sannsyn","Konsekvens","Risiko","Moglege nye tiltak","Ansvarleg","Frist","Inkluderast i DPIA? "]
{"$rows_left_out":101}
{"sheet":"Risikokriterie","index":2,"n_rows":17,"n_cols":7,"rows_kept":17,"cut":false,"hidden":false,"merged":[]}
["Sannsynmatrise:"]
["Eksempel på tilnærming","Ubetydeleg (1)","Låg (2)","Middels (3)","Høg (4)","Svært høg (5)"]
["Frekvens (kor ofte oppstår hendinga)"," ","Forventast å inntreffe årleg","Forventast å inntreffe minst kvartalsvis","Forventast å inntreffe tilnærma månadleg","Forventast å inntreffe vekentleg"]
[null,"Hendinga kan oppstå under heilt spesielle omstende (inntreff med 0-5 % sannsyn)","Hendinga kan oppstå under sjeldne omstende (inntreffer med 5-10 % sannsyn)","Hendinga kan oppstå under nokon omstende (inntreff med 10-30 % sannsyn)","Hendinga kan oppstå under fleire omstende (inntreff med 30-70 % sannsyn)","Hendinga kan oppstå under fleire omstende (inntreff med 70-100 % sannsyn)"]
["Etterleving av tiltak (I kva grad eksisterar/vert tiltaka fulgt?)","- Sikkerheitstiltak er etablert og fungerar etter hensikt\n- Tiltaka kan vanskeleg omgås/brytast av eigne tilsette\n- Eksternt personell kan ikkje omgå/bryta tiltaka","- Sikkerheitstiltak er etablert, men det er ikkje etterprøvd om dei fungerar etter hensikt. \n- Tiltaka kan vanskeleg omgås/brytast av eigne tilsette\n- Eksternt personell kan ikkje omgå/bryte tiltaka ","- Sikkerheitstiltak er ikkje fullt ut etablert etter sikkerheitsbehovet.\n- Tiltaka kan omgås/brytast av eigne tilsette med små til normale ressursar \n- Eksternt personell treng gode ressursar, og god/fullstendig kjennskap til tiltaka for å omgå/bryte desse","- Sikkerheitstiltak er ikkje fullt ut etablert, eller fungerar ikkje etter hensikta\n- Eigne tilsette treng berre små til normale ressursar for å omgå/bryte tiltaka\n- Eksternt personell treng normal kjennskap til tiltaka, i tillegg til små/normale ressursar for å bryte tiltaka","- Sikkerheitstiltak er ikkje etablert, eller sikkerheitstiltak er sterkt avhengig av at ei eller fleire manuelle rutinar vert fulgt\n- Eigne tilsette treng ikkje kjennskap til tiltaka, eller det kan oppstå hendingar som følgje av uhell eller uaktsomheit. \n- Utanforståande/eksternt personell treng ikkje kjennskap til tiltaka, eller kan omgå utan særskilt kompetanse/kapasitet/motivasjon"]
[]
{"$rows_left_out":12}
{"sheet":"Tema for risikovurdering","index":3,"n_rows":10,"n_cols":2,"rows_kept":10,"cut":false,"hidden":false,"merged":[[0,0,0,1]]}
["Temaer for diskusjon i risikovurdering"]
[]
[]
["Tema","Problemstillingar og hendingar"]
["Konfidensialitet og innsyn","* Skal dei registrerte sjølv kunne sjå informasjon i løysinga?\n- Skal dei kunne sjå informasjon om andre personar enn seg sjølv? Korleis får dei i så fall tilgang til dette? Vil opplysningar om kven som skal sjå informasjon om kven alltid være korrekte?\n- Kva informasjon får dei registrerte sjå? Har me tilstrekkelig sikker pålogging som gjer det vanskeleg for uvedkommande å få tilgang til andre sin informasjon?\n* Er løysinga beskytta mot avlytting av nettverkstrafikk?"]
["Tilgangsstyring","* Finnes det ulike grupper av saksbehandlarar/brukarar/tilsette som skal nytte løysinga?\n- Er det problematisk om alle brukarar kan sjå all informasjon i løysinga?\n- Er det problematisk om alle brukarar har tilgang til å gjere alle endringar eller legge inn ny informasjon?"]
{"$rows_left_out":5}
{"sheet":"Hjelpespørsmål","index":4,"n_rows":31,"n_cols":1,"rows_kept":31,"cut":false,"hidden":false,"merged":[]}
[]
["Hjelpespørsmål til gjennomføring av risiko- og sårbarheitsvurdering (ROS-vurdering) "]
[]
["Identifisere og kartlegge"]
["·         Har me oversyn over kva type informasjon systemet behandlar? (Taushetsbelagt, verksemdskritisk,  særlege kategoriar av personopplysningar etc.)"]
["o   Er det behov for særlege vurderingar av sikkerheitsnivå basert på informasjonen som vert lagra/behandlast?"]
{"$rows_left_out":26}
{"sheet":"Datakjelder","index":5,"n_rows":9,"n_cols":3,"rows_kept":9,"cut":false,"hidden":false,"merged":[]}
[]
[]
[]
[null,null,"Kategori"]
[null,null,"Funksjonell"]
[null,null,"Teknisk"]
{"$rows_left_out":4}
{"sheet":"Dataark","index":6,"n_rows":192,"n_cols":36,"rows_kept":192,"cut":false,"hidden":true,"merged":[[1,1,1,25],[1,29,1,34],[0,0,0,5],[14,31,14,35],[16,29,20,29]]}
["Passord for endring: bergenkommune"]
[null,"Datamatrise",null,null,null,null,null,null,null,null,null,null,null,null,null,null,null,null,null,null,null,null,null,null,null,null,null,null,null,"Risikomatrise"]
["Konsekvens","Svært liten","Svært liten","Svært liten","Svært liten","Svært liten","Liten","Liten","Liten","Liten","Liten","Middels","Middels","Middels","Middels","Middels","Stor","Stor","Stor","Stor","Stor","Svært stor","Svært stor","Svært stor","Svært stor","Svært stor"]
["Sannsynlighet","Meget lav","Lav","Middels","Høy","Svært høy","Meget lav","Lav","Middels","Høy","Svært høy","Meget lav","Lav","Middels","Høy","Svært høy","Meget lav","Lav","Middels","Høy","Svært høy","Meget lav","Lav","Middels","Høy","Svært høy"]
[null,{"$f":"IF((AND(Risikovurdering!J7=1,Risikovurdering!I7=1)),Risikovurdering!B7&\",\",\"\")","v":""},{"$f":"IF((AND(Risikovurdering!J7=1,Risikovurdering!I7=2)),Risikovurdering!B7&\",\",\"\")","v":""},{"$f":"IF((AND(Risikovurdering!J7=1,Risikovurdering!I7=3)),Risikovurdering!B7&\",\",\"\")","v":""},{"$f":"IF((AND(Risikovurdering!J7=1,Risikovurdering!I7=4)),Risikovurdering!B7&\",\",\"\")","v":""},{"$f":"IF((AND(Risikovurdering!J7=1,Risikovurdering!I7=5)),Risikovurdering!B7&\",\",\"\")","v":""},{"$f":"IF((AND(Risikovurdering!J7=2,Risikovurdering!I7=1)),Risikovurdering!B7&\",\",\"\")","v":""},{"$f":"IF((AND(Risikovurdering!J7=2,Risikovurdering!I7=2)),Risikovurdering!B7&\",\",\"\")","v":""},{"$f":"IF((AND(Risikovurdering!J7=2,Risikovurdering!I7=3)),Risikovurdering!B7&\",\",\"\")","v":""},{"$f":"IF((AND(Risikovurdering!J7=2,Risikovurdering!I7=4)),Risikovurdering!B7&\",\",\"\")","v":""},{"$f":"IF((AND(Risikovurdering!J7=2,Risikovurdering!I7=5)),Risikovurdering!B7&\",\",\"\")","v":""},{"$f":"IF((AND(Risikovurdering!J7=3,Risikovurdering!I7=1)),Risikovurdering!B7&\",\",\"\")","v":""},{"$f":"IF((AND(Risikovurdering!J7=3,Risikovurdering!I7=2)),Risikovurdering!B7&\",\",\"\")","v":""},{"$f":"IF((AND(Risikovurdering!J7=3,Risikovurdering!I7=3)),Risikovurdering!B7&\",\",\"\")","v":""},{"$f":"IF((AND(Risikovurdering!J7=3,Risikovurdering!I7=4)),Risikovurdering!B7&\",\",\"\")","v":""},{"$f":"IF((AND(Risikovurdering!J7=3,Risikovurdering!I7=5)),Risikovurdering!B7&\",\",\"\")","v":""},{"$f":"IF((AND(Risikovurdering!J7=4,Risikovurdering!I7=1)),Risikovurdering!B7&\",\",\"\")","v":""},{"$f":"IF((AND(Risikovurdering!J7=4,Risikovurdering!I7=2)),Risikovurdering!B7&\",\",\"\")","v":""},{"$f":"IF((AND(Risikovurdering!J7=4,Risikovurdering!I7=3)),Risikovurdering!B7&\",\",\"\")","v":""},{"$f":"IF((AND(Risikovurdering!J7=4,Risikovurdering!I7=4)),Risikovurdering!B7&\",\",\"\")","v":""},{"$f":"IF((AND(Risikovurdering!J7=4,Risikovurdering!I7=5)),Risikovurdering!B7&\",\",\"\")","v":""},{"$f":"IF((AND(Risikovurdering!J7=5,Risikovurdering!I7=1)),Risikovurdering!B7&\",\",\"\")","v":""},{"$f":"IF((AND(Risikovurdering!J7=5,Risikovurdering!I7=2)),Risikovurdering!B7&\",\",\"\")","v":""},{"$f":"IF((AND(Risikovurdering!J7=5,Risikovurdering!I7=3)),Risikovurdering!B7&\",\",\"\")","v":""},{"$f":"IF((AND(Risikovurdering!J7=5,Risikovurdering!I7=4)),Risikovurdering!B7&\",\",\"\")","v":""},{"$f":"IF((AND(Risikovurdering!J7=5,Risikovurdering!I7=5)),Risikovurdering!B7&\",\",\"\")","v":""}]
[null,{"$f":"IF((AND(Risikovurdering!J8=1,Risikovurdering!I8=1)),Risikovurdering!B8&\",\",\"\")","v":""},{"$f":"IF((AND(Risikovurdering!J8=1,Risikovurdering!I8=2)),Risikovurdering!B8&\",\",\"\")","v":""},{"$f":"IF((AND(Risikovurdering!J8=1,Risikovurdering!I8=3)),Risikovurdering!B8&\",\",\"\")","v":""},{"$f":"IF((AND(Risikovurdering!J8=1,Risikovurdering!I8=4)),Risikovurdering!B8&\",\",\"\")","v":""},{"$f":"IF((AND(Risikovurdering!J8=1,Risikovurdering!I8=5)),Risikovurdering!B8&\",\",\"\")","v":""},{"$f":"IF((AND(Risikovurdering!J8=2,Risikovurdering!I8=1)),Risikovurdering!B8&\",\",\"\")","v":""},{"$f":"IF((AND(Risikovurdering!J8=2,Risikovurdering!I8=2)),Risikovurdering!B8&\",\",\"\")","v":""},{"$f":"IF((AND(Risikovurdering!J8=2,Risikovurdering!I8=3)),Risikovurdering!B8&\",\",\"\")","v":""},{"$f":"IF((AND(Risikovurdering!J8=2,Risikovurdering!I8=4)),Risikovurdering!B8&\",\",\"\")","v":""},{"$f":"IF((AND(Risikovurdering!J8=2,Risikovurdering!I8=5)),Risikovurdering!B8&\",\",\"\")","v":""},{"$f":"IF((AND(Risikovurdering!J8=3,Risikovurdering!I8=1)),Risikovurdering!B8&\",\",\"\")","v":""},{"$f":"IF((AND(Risikovurdering!J8=3,Risikovurdering!I8=2)),Risikovurdering!B8&\",\",\"\")","v":""},{"$f":"IF((AND(Risikovurdering!J8=3,Risikovurdering!I8=3)),Risikovurdering!B8&\",\",\"\")","v":""},{"$f":"IF((AND(Risikovurdering!J8=3,Risikovurdering!I8=4)),Risikovurdering!B8&\",\",\"\")","v":""},{"$f":"IF((AND(Risikovurdering!J8=3,Risikovurdering!I8=5)),Risikovurdering!B8&\",\",\"\")","v":""},{"$f":"IF((AND(Risikovurdering!J8=4,Risikovurdering!I8=1)),Risikovurdering!B8&\",\",\"\")","v":""},{"$f":"IF((AND(Risikovurdering!J8=4,Risikovurdering!I8=2)),Risikovurdering!B8&\",\",\"\")","v":""},{"$f":"IF((AND(Risikovurdering!J8=4,Risikovurdering!I8=3)),Risikovurdering!B8&\",\",\"\")","v":""},{"$f":"IF((AND(Risikovurdering!J8=4,Risikovurdering!I8=4)),Risikovurdering!B8&\",\",\"\")","v":""},{"$f":"IF((AND(Risikovurdering!J8=4,Risikovurdering!I8=5)),Risikovurdering!B8&\",\",\"\")","v":""},{"$f":"IF((AND(Risikovurdering!J8=5,Risikovurdering!I8=1)),Risikovurdering!B8&\",\",\"\")","v":""},{"$f":"IF((AND(Risikovurdering!J8=5,Risikovurdering!I8=2)),Risikovurdering!B8&\",\",\"\")","v":""},{"$f":"IF((AND(Risikovurdering!J8=5,Risikovurdering!I8=3)),Risikovurdering!B8&\",\",\"\")","v":""},{"$f":"IF((AND(Risikovurdering!J8=5,Risikovurdering!I8=4)),Risikovurdering!B8&\",\",\"\")","v":""},{"$f":"IF((AND(Risikovurdering!J8=5,Risikovurdering!I8=5)),Risikovurdering!B8&\",\",\"\")","v":""},null,null,null,"Svært høy",{"$f":"F5&\nF6&\nF7&\nF8&\nF9&\nF10&\nF11&\nF12&\nF13&\nF14&\nF15&\nF16&\nF17&\nF18&\nF19&\nF20&\nF21&\nF22&\nF23&\nF24&\nF25&\nF26&\nF27&\nF28&\nF29&\nF30&\nF31&\nF32&\nF33&\nF34&\nF35&\nF36&\nF37&\nF38&\nF39&\nF40&\nF41&\nF42&\nF43&\nF44&\nF45&\nF46&\nF47&\nF48&\nF49&\nF50&\nF51&\nF52&\nF53&\nF54&\nF55&\nF56&\nF57&\nF58&\nF59&\nF60&\nF61&\nF62&\nF63&\nF64&\nF65&\nF66&\nF67&\nF68&\nF69&\nF70&\nF71&\nF72&\nF73&\nF74&\nF75&\nF76&\nF77&\nF78&\nF79&\nF80&\nF81&\nF82&\nF83&\nF84&\nF85&\nF86&\nF87&\nF88&\nF89&\nF90&\nF91&\nF92&\nF93&\nF94&\nF95&\nF96&\nF97&\nF98&\nF99&\nF100","v":""},{"$f":"K5&\nK6&\nK7&\nK8&\nK9&\nK10&\nK11&\nK12&\nK13&\nK14&\nK15&\nK16&\nK17&\nK18&\nK19&\nK20&\nK21&\nK22&\nK23&\nK24&\nK25&\nK26&\nK27&\nK28&\nK29&\nK30&\nK31&\nK32&\nK33&\nK34&\nK35&\nK36&\nK37&\nK38&\nK39&\nK40&\nK41&\nK42&\nK43&\nK44&\nK45&\nK46&\nK47&\nK48&\nK49&\nK50&\nK51&\nK52&\nK53&\nK54&\nK55&\nK56&\nK57&\nK58&\nK59&\nK60&\nK61&\nK62&\nK63&\nK64&\nK65&\nK66&\nK67&\nK68&\nK69&\nK70&\nK71&\nK72&\nK73&\nK74&\nK75&\nK76&\nK77&\nK78&\nK79&\nK80&\nK81&\nK82&\nK83&\nK84&\nK85&\nK86&\nK87&\nK88&\nK89&\nK90&\nK91&\nK92&\nK93&\nK94&\nK95&\nK96&\nK97&\nK98&\nK99&\nK100","v":""},{"$f":"P5&\nP6&\nP7&\nP8&\nP9&\nP10&\nP11&\nP12&\nP13&\nP14&\nP15&\nP16&\nP17&\nP18&\nP19&\nP20&\nP21&\nP22&\nP23&\nP24&\nP25&\nP26&\nP27&\nP28&\nP29&\nP30&\nP31&\nP32&\nP33&\nP34&\nP35&\nP36&\nP37&\nP38&\nP39&\nP40&\nP41&\nP42&\nP43&\nP44&\nP45&\nP46&\nP47&\nP48&\nP49&\nP50&\nP51&\nP52&\nP53&\nP54&\nP55&\nP56&\nP57&\nP58&\nP59&\nP60&\nP61&\nP62&\nP63&\nP64&\nP65&\nP66&\nP67&\nP68&\nP69&\nP70&\nP71&\nP72&\nP73&\nP74&\nP75&\nP76&\nP77&\nP78&\nP79&\nP80&\nP81&\nP82&\nP83&\nP84&\nP85&\nP86&\nP87&\nP88&\nP89&\nP90&\nP91&\nP92&\nP93&\nP94&\nP95&\nP96&\nP97&\nP98&\nP99&\nP100","v":""},{"$f":"U5&\nU6&\nU7&\nU8&\nU9&\nU10&\nU11&\nU12&\nU13&\nU14&\nU15&\nU16&\nU17&\nU18&\nU19&\nU20&\nU21&\nU22&\nU23&\nU24&\nU25&\nU26&\nU27&\nU28&\nU29&\nU30&\nU31&\nU32&\nU33&\nU34&\nU35&\nU36&\nU37&\nU38&\nU39&\nU40&\nU41&\nU42&\nU43&\nU44&\nU45&\nU46&\nU47&\nU48&\nU49&\nU50&\nU51&\nU52&\nU53&\nU54&\nU55&\nU56&\nU57&\nU58&\nU59&\nU60&\nU61&\nU62&\nU63&\nU64&\nU65&\nU66&\nU67&\nU68&\nU69&\nU70&\nU71&\nU72&\nU73&\nU74&\nU75&\nU76&\nU77&\nU78&\nU79&\nU80&\nU81&\nU82&\nU83&\nU84&\nU85&\nU86&\nU87&\nU88&\nU89&\nU90&\nU91&\nU92&\nU93&\nU94&\nU95&\nU96&\nU97&\nU98&\nU99&\nU100","v":""},{"$f":"Z6&\nZ7&\nZ8&\nZ9&\nZ10&\nZ11&\nZ12&\nZ13&\nZ14&\nZ15&\nZ16&\nZ17&\nZ18&\nZ19&\nZ20&\nZ21&\nZ22&\nZ23&\nZ24&\nZ25&\nZ26&\nZ27&\nZ28&\nZ29&\nZ30&\nZ31&\nZ32&\nZ33&\nZ34&\nZ35&\nZ36&\nZ37&\nZ38&\nZ39&\nZ40&\nZ41&\nZ42&\nZ43&\nZ44&\nZ45&\nZ46&\nZ47&\nZ48&\nZ49&\nZ50&\nZ51&\nZ52&\nZ53&\nZ54&\nZ55&\nZ56&\nZ57&\nZ58&\nZ59&\nZ60&\nZ61&\nZ62&\nZ63&\nZ64&\nZ65&\nZ66&\nZ67&\nZ68&\nZ69&\nZ70&\nZ71&\nZ72&\nZ73&\nZ74&\nZ75&\nZ76&\nZ77&\nZ78&\nZ79&\nZ80&\nZ81&\nZ82&\nZ83&\nZ84&\nZ85&\nZ86&\nZ87&\nZ88&\nZ89&\nZ90&\nZ91&\nZ92&\nZ93&\nZ94&\nZ95&\nZ96&\nZ97&\nZ98&\nZ99&\nZ100","v":""}]
{"$rows_left_out":186}